How to sign out of google drive on mac
Left headlight and taillight not working
If they are already on the channel this doesn't kick them (needs chanop)" msgstr "" #: src/common/outbound.c:3506 msgid "CHANOPT [-quiet] []" msgstr "" #: src/common/outbound.c:3508 msgid "CLEAR [ALL|HISTORY], Clears the current text window or command history" msgstr "" #: src/common/outbound.c:3509 msgid "CLOSE, Closes the current window/tab ...
Photoshop typography effects
Oct 23, 2018 · We will use "yarn" to install the CLI via "yarn add -D". Do you want to install 'webpack-cli' ( yes /no ) : yes Installing 'webpack-cli' ( running 'yarn add -D webpack-cli' ) ... I am missing Webpack CLI which I of course have as a development dependency locally so it never installed on the production server during build (and gave me a headache).
Integra turbo kit with ac
This package is partially broken. When Jellyfin is installed it will still ask for files used when building it, meaning that, if like me, you clean the cache directory of your AUR helper / remove the directory where you did the makepkg you will get issues.
Branches of government worksheet 2nd grade
Cartridge entry/exit error: Check the entry/exit ports for a jammed volume. 301: X'12D' Cartridge load failure: Check the drive for jammed volumes. On AIX, display the errpt to check for hardware errors. 302: X'12E' Cartridge in failed drive: Check the drive for jammed volumes. On AIX, display the errpt to check for hardware errors. 303: X'12F ...
Dodge caravan not accelerating
Dec 03, 2018 · Exit Status. Every Linux command executed by the shell script or user, has an exit status. The exit status is an integer number. The Linux man pages stats the exit statuses of each command. 0 exit status means the command was successful without any errors. A non-zero (1-255 values) exit status means command was failure.
Rfid writer phone
Azure DevOps – The command “gulp build” exited with code 134. January 31, 2019 Azure , Tech Help 0 Comments I had a CI/CD pipeline working for a long while now without any issues in Azure DevOps.
Edgerouter snmp mib
If a container is no longer running, use the following command to find the status of the container: docker container ls -a This article explains possible reasons for the following exit code: "task: non-zero exit (137)" With exit code 137, you might also notice a status of Shutdown or the following failed message: Failed 42 hours ago Resolution
Pi network coinmarketcap
Aug 08, 2018 · after i increased the driver-memory to 96g, the problem was solved.
Enthusiast or great lover of something crossword clue
I would not advise to do this - only if you have no other options and you are sure there are classpath problems (this suggests you had that - likely not having set up the Spark service dependency with Hive).
Two objects of the same mass fall from different heights
With --color=auto, ls emits color codes only when standard output is connected to a terminal. The LS_COLORS environment variable can change the settings. Use thedircolors command to set it. Exit Status
Why is my spectrum app not working on my smart tv
첫번째 시도 : rm -rf yarn.lock / rm -rf package-lock.json -> 실패. 두번째 시도 : yarn upgrade -> 실패. 세번째 시도 : yarn install -> yarn 설치는 성공했으나 react 앱 초기화 실패. 네 번째 시도 : rm -rf node_modules -> 성공!!!!! 브라우저에 이런 화면이 뜨면서 정상적으로 앱 구동이 된다 ...

Vehicle simulator infinite money script pastebin 2020

Ve series 2 speaker upgrade

Code Name Description Comment; 0: OK: Indicates successful completion of the operation. 1: EOF: An attempt to read past the end-of-file was made; or, there are no more directory entries to return. May 18, 2017 · sh: line 1: 26853 Abort trap: 6 webpack-dev-server --hot --progress --history-api-fallback --config webpack/webpack.dev.config.js --content-base html/ error Command failed with exit code 134. There is no other output and we haven't yet been able to determine what's causing it. it seems to be fairly random, but consistent. Nov 20, 2012 · This command call failed. Or it did not return the proper information to the Vault eject process. Status Code 301 ===== vmchange api_eject command failed During the eject process, the vmchange command is called with an "-api_eject" call to begin the process to eject media. This command call failed. Status Code 302 ===== Mar 24 02:49:13 server systemd[1]: mariadb.service: Main process exited, code=exited, status=1/FAILURE Mar 24 02:49:13 server systemd[1] Mar 24 02:57:07 server systemd[1]: Failed to set devices.allow on /system.slice/mariadb.service: Operation not permitted Mar 24 02:57:07 server...Exit codes other than "0"(or EXIT_FAILURE) indicate the presence of an error in the code. Among all the exit codes, the codes 1, 2, 126 - 165 and 255 have special meanings and hence exit(134): It indicates that a program was aborted (received SIGABRT), perhaps as a result of a failed assertion.Hi, I'm having my gobblin run failed for some reason. After I've checked yarn application logs I've found the following lines. Would you mind to Hello community, Since a week I can’t deploy new version of our app. The command “yarn build” fail each time without so much information. Can you see something I may made wrong ? Thanks a lot ! Here my variables : Key CYPRESS_RECORD_KEY Value ea2ec1ea-edbe-40f0-9300-72 DEBUG netlify-plugin-cypress,netlify-plugin-cypress:verbose NODE_VERSION 12.16.2 YARN_VERSION 1.22.4 Here the build log ... 1.4.1 Code 0 - Successful Completion. This is NOT an error code, the one exception among all other codes you might encounter. If a program returns this code, then ...


Forest river rockwood campers for sale

To run this script in Netlify, set the Build command to npm run {YOUR_BUILD_SCRIPT} or yarn {YOUR_BUILD_SCRIPT}, depending on your chosen JavaScript dependency manager. The Publish directory for single-page apps is often called dist , but varies by framework and build tool. Package install fails with sed error. Some of the BigBlueButton packages use sed scripts to extract contents from configuration files. If you see [ Fail ], then your nginx configuration files might have a syntax error. Check the syntax of the nginx configuration files using the command.Artikel ini menjelaskan tentang : cara keluar (Exit) dari BIOS, menggunakan menu Exit pada BIOS, melakukan Save Setting BIOS, dan keluar dari BIOS tanpa melakukan saving (membatalkan semua perubahan). ** Gambar dibawah ini bisa sangat berbeda dari BIOS milik Anda, silahkan mengacu pada manual yang ada. Klik gambar tampilan lebih besar. Jun 20, 2019 · When I run the 'npm install' command, It suggesting me to use yarn instead system (system) closed July 19, 2019, 11:52am #6

  1. The source code is in a Git repository in GitHub (your application, infrastructure, and pipeline code), and your CI/CD pipeline is an Azure YAML Pipeline. Azure Container Registry (ACR) is an Azure-native container registry, much like Docker Hub but it’s Azure’s container registry solution, so it integrates with other Azure resources and ...
  2. GitHub Gist: instantly share code, notes, and snippets.
  3. Коды ошибок менеджера лицензий. Errors marked with an '*' indicates errors which should not appear in shipping software. Errors marked with '+' indicate errors due to an operating system failure.
  4. Kamu mengalami masalah seperti gambar diatas ketika menjalankan aplikasi React JS dengan Yarn? Tenang, berikut penjelasannya. Penyebab masalah ini adalah ketika telah terjadi banyak perubahan pada…
  5. msgstr "" #: src/common/outbound.c:3238 msgid "No such plugin found. " msgstr "" #: src/common/outbound.c:3243 src/fe-gtk/plugingui.c:186 msgid "That plugin is refusing to unload. " msgstr "" #: src/common/outbound.c:3512 msgid "ADDBUTTON , adds a button under the user-list" msgstr "" #: src/common/outbound.c:3514 msgid "ALLCHAN , sends a ... Sep 08, 2020 · Hi I’ve cloned the code for the 3lo-test-playground demo test app mentioned here I am following the steps mentioned in the README.md files, and am experiencing build issues at Step 3) Build the app. yarn && yarn build Has anyone seen this issue, or can specify some versions of the dependencies that worked for you? Errors are below : yarn && yarn build yarn install v1.22.5 [1/4] Resolving ...
  6. Usage: command [arguments] [options] Global Options: --env Set NODE_ENV before running the commands --no-ansi Disable colored output Available Commands: seed Seed database using seed files migration migration:refresh Refresh migrations by performing rollback and then running from start migration:reset Rollback migration to the first batch migration:rollback Rollback migration to latest batch ... IceWarp Server For Windows (Windows 8/2012/7/2008/Vista/2003/XP) & Linux Copyright (c) 1999-2014 IceWarp Ltd. All rights reserved. Release Notes ... Aug 10, 2015 · We are trying to better understand customer views on social support experience, so your participation in this interview project would be greatly appreciated if you have time.
  7. error— Display generic error message and exit 3 18. you must start with an empty dataset The command (for example, infile) requires that no data be in memory—you ...
  8. Dec 20, 2018 · When you ran yarn add --dev ... yarn destroys the patch that we add, so you have to run yarn kbn bootstrap again to patch the bin scripts. Because of this and other minor gotchas I recommend editing the package.json file directly rather than using yarn add ... and then run yarn kbn bootstrap to install/remove dependencies from your plugin.
  9. Exit Codes. Exit codes are a number between 0 and 255, which is returned by any Unix command when it returns control to its parent process. Other numbers can be used, but these are treated modulo 256, so exit -10 is equivalent to exit 246, and exit 257 is equivalent to exit 1. Apr 11, 2011 · Jesse. A few things we can do after looking at your logs I noticed you are downloading IE to your "D:\dload\Programs\Windows 7\IE9-Windows7-x64-enu.exe" Change your download location to anywhere on the C: we have ran into a few cases like this and that did fix the issue. Official Google Search Help Center where you can find tips and tutorials on using Google Search and other answers to frequently asked questions.
  10. React Native初始化项目报错 ---Command `yarn add react-native --exact` failed. RELY_ON_YOURSELF 2018-02-08 15:28 2626 查看 因为npm的服务器是架在国外的 , 在国内的访问速度不行 , 为了提高npm的下载速度 , 我们可以使用淘宝的npm镜像. Ошибка возникает в Fedora в момент установки Twisted: #include "Python.h" ^~ compilation terminated. error #include "Python.h" ^~. compilation terminated. error: command 'gcc' failed with exit status 1 ... failed with error code 1 in /tmp/pip-install-Y54MLT/twisted/.Aug 31, 2020 · mohan test wrote:my questions: 1. does kali linux work on macos big sur ? 2. do i need to install any special driver (Kernel driver) 3. as of now i have installed virtual box successfully (by giving allow access in system preferences and restarted by system a couple of times as well), but same issues pops up when i open kali linux.
  11. The code will work just fine, an error involving "linker" means that there are problems with the projects linker settings. I'm not sure exactly what the problem is, but you should try a tutorial for setting up a project in your IDE because there's probably something in the settings that needs to be changed.
  12. React Native初始化项目报错 ---Command `yarn add react-native --exact` failed. RELY_ON_YOURSELF 2018-02-08 15:28 2626 查看 因为npm的服务器是架在国外的 , 在国内的访问速度不行 , 为了提高npm的下载速度 , 我们可以使用淘宝的npm镜像. In this case, the Spark streaming Yarn app application_1525986016285_0193 failed, due to error: 18/05/17 20:01:33 WARN YarnAllocator: Container marked as failed: container_e25_1525986016285_0193_01_000032 on host: wn87-Scaled.2ajnsmlgqdsutaqydyzfzii3le.cx.internal.cloudapp.net. Exit status: 50. Diagnostics: Exception from container-launch.

 

Ls3 idle timing

Dec 18, 2020 · Also, Cloud Shell sessions automatically exit after a period of inactivity (30 minutes). gcloud command-line tool: The gcloud compute ssh command with dynamic port forwarding allows you to establish an SSH tunnel and run a SOCKS proxy server on top of the tunnel. After issuing this command, you must configure your local browser to use the SOCKS ... ...commands failed: CodeSign build/device/Allevamento\ Newstarwood.app (1 failure) Error code 65 for command newstarwood/platforms/ios/build/sharedpch Command finished with error code 2 Command failed with exit code 2 You may not have the required environment or OS to build this...

During assets compilation with , or you may run into this error: error Command failed with exit code 2 Workaround In order to fix it try… Unfortunately, such errors may also occur during the yarn start or npm start command execution and you will not get any message .So, for example, if the test runner completes with no failed tests it exits with zero. If one test failed, even though the test runner itself ran propely, it exits with one 1. If two fail it returns 2, etc. This goes up to 250, which means "250 or more test failures". It uses exit codes > 250 to signify abnormal exits. @monoid What a fiasco! The electron7 package was dropped from [community] but there is an AUR package eletron7-bin that provides it. You can use that. This is actually available for 8 too and I didn't want to go down the road of using an AUR bin package, but there is less and less options available to us.

Long cove marina and campground

msgstr "" #: src/common/outbound.c:3238 msgid "No such plugin found. " msgstr "" #: src/common/outbound.c:3243 src/fe-gtk/plugingui.c:186 msgid "That plugin is refusing to unload. " msgstr "" #: src/common/outbound.c:3512 msgid "ADDBUTTON , adds a button under the user-list" msgstr "" #: src/common/outbound.c:3514 msgid "ALLCHAN , sends a ...

Gila river per capita amount for july 2020

Aug 10, 2015 · This site uses cookies for analytics, personalized content and ads. By continuing to browse this site, you agree to this use. Learn more If they are already on the channel this doesn't kick them (needs chanop)" msgstr "" #: src/common/outbound.c:3508 #, fuzzy msgid "CHANOPT [-quiet] []" msgstr "SET [-quiet] []" #: src/common/outbound.c:3510 #, fuzzy msgid "CLEAR [ALL|HISTORY], Clears the current text window or command history" msgstr "CLEAR, uneko testu leihoa garbitzen du ... If the server upgrade fails repeatedly, the server can be started with the --upgrade=MINIMAL option to start the server without executing the upgrade sequence, thus allowing users to manually rectify the problem.Aug 16, 2017 · This is the exit value of the top process in the job, typically the shell. This may be the exit value of the last command executed in the shell or the .logout script if the user has such a script (csh). X >=128 (or 256 depending on the system) This means the job was killed with a signal. The signal is given by X modulo 128 (or 256). To pass a user text to a user exit module, use the NOTIFY MSG command immediately preceding the NOTIFY EXIT or EXIT64 command. For example:.SET NOTIFY HIGH MSG ‘user-text’.SET NOTIFY HIGH EXIT btnfyext. This user text remains in effect until the next NOTIFY MSG command is executed, resulting in all user exit functions receiving the same ... Mar 05, 2019 · RUN yarn run build RUN npm install RUN npm run build. I'm not so sure why I need to do npm command twice, but there are too many discussion about these two differeneces, so I just drop it here in case somebody out there prefer to use npm rather than yarn for the build command. PS: Peter, I haven't found your article about dockerized Go project ;) Sep 02, 2018 · If you’re looking for some help, it’s important to provide as much context as possible so that people are able to assist you. Try to always mention: - What version of Ghost are you using? ghost 1.9.2 - What configuration? ubuntu 18.04 - What errors or information do you see in the console? ghost install Checking system Node.js version Checking logged in user Checking current folder ...

Mac tool box weight

I thought an Exit Code 1001 meant more than 1 instance of TC or TestExecute was being used. However, there's nothing in my Task Manager indicating this. Does anyone know what this could mean? Kamu mengalami masalah seperti gambar diatas ketika menjalankan aplikasi React JS dengan Yarn? Tenang, berikut penjelasannya. Penyebab masalah ini adalah ketika telah terjadi banyak perubahan pada…Jun 20, 2019 · When I run the 'npm install' command, It suggesting me to use yarn instead system (system) closed July 19, 2019, 11:52am #6 If you get an error Minecraft closed with exit code: -1073740791, there will be a decision with all the necessary actions in this article. This error can occur because of an update NVIDIA graphics driver to version 378.49. The symptoms are: a bug when running Minecraft with code -1073740791 or...KoDDoS ... ・ csdn已为您找到关于cvxpy相关内容,包含cvxpy相关文档代码介绍、相关教程视频课程,以及相关cvxpy问答内容。为您解决当下相关问题,如果想了解更详细cvxpy内容,请点击详情链接进行了解,或者注册账号与客服人员联系给您提供相关内容的帮助,以下是为您准备的相关内容。

Eec 61 spn 4335 fail 1

To run this script in Netlify, set the Build command to npm run {YOUR_BUILD_SCRIPT} or yarn {YOUR_BUILD_SCRIPT}, depending on your chosen JavaScript dependency manager. The Publish directory for single-page apps is often called dist , but varies by framework and build tool. Dec 15, 2019 · And again run the app, and this time you will get this error: Now, there are some more work to be done, as answered in this Stackoverflow post : Require all dependencies you need in the main.js ... Dec 20, 2018 · When you ran yarn add --dev ... yarn destroys the patch that we add, so you have to run yarn kbn bootstrap again to patch the bin scripts. Because of this and other minor gotchas I recommend editing the package.json file directly rather than using yarn add ... and then run yarn kbn bootstrap to install/remove dependencies from your plugin.

Vintage ethan allen buffet

This happens with all images, I tried in another installation and it works fine. This happens in both yarn start and yarn build. Notes: I rolled back to [email protected] from [email protected] and it still happens. I/usr/include/python3.4m -I/home/ondra/zelvovani/include/python3.4m -c _mysql.c -o build/temp.linux-i686-3.4/_mysql.o -DBIG_JOINS=1 -fno-strict-aliasing -DTAOCRYPT_DISABLE_X86ASM -g -DNDEBUG error: command 'i586-linux-gnu-gcc' failed with exit status 1 Complete output from...Aug 08, 2018 · after i increased the driver-memory to 96g, the problem was solved. If you want to install the packages using yarn instead, you can pass the --yarn flag to the command: wdio install service sauce --yarn You could also pass a custom configuration path if your WDIO config file is not in the same folder you're working on: This work fine on Android (Having a hard time with some errors on that side though.) But I have problem with the unity plugin when building the I have no idea about this, the only clue that I got are. - run custom shell script 'check pods manifest.lock' and. - Command /bin/sh failed with exit code 127.Nov 25, 2019 · Failed to stop DB2 services. 34. Failed to start Oracle services. 35. Failed to start DB2 services. 36. Search index location path not valid. 37. Invalid search engine port. 38. Select packages already installed. 39. Missing payload. 40. Wrong command line. 41. Explorer plug-in binaries locked. 42. Failed to install third-party. 43. Failed to ... csdn已为您找到关于cvxpy相关内容,包含cvxpy相关文档代码介绍、相关教程视频课程,以及相关cvxpy问答内容。为您解决当下相关问题,如果想了解更详细cvxpy内容,请点击详情链接进行了解,或者注册账号与客服人员联系给您提供相关内容的帮助,以下是为您准备的相关内容。 This happens with all images, I tried in another installation and it works fine. This happens in both yarn start and yarn build. Notes: I rolled back to [email protected] from [email protected] and it still happens. CDH 5.4 . I am running my spark streaming application using spark-submit on yarn-cluster. When I run it on local mode it is working fine. But when I try to run it on yarn-cluster using spark-submit, it runs for some time and then exits with following execption

Pandas cross join without key

Dec 15, 2019 · And again run the app, and this time you will get this error: Now, there are some more work to be done, as answered in this Stackoverflow post : Require all dependencies you need in the main.js ... I/usr/include/python3.4m -I/home/ondra/zelvovani/include/python3.4m -c _mysql.c -o build/temp.linux-i686-3.4/_mysql.o -DBIG_JOINS=1 -fno-strict-aliasing -DTAOCRYPT_DISABLE_X86ASM -g -DNDEBUG error: command 'i586-linux-gnu-gcc' failed with exit status 1 Complete output from...

Zearn hacks

I thought an Exit Code 1001 meant more than 1 instance of TC or TestExecute was being used. However, there's nothing in my Task Manager indicating this. Does anyone know what this could mean? サマリ yarn + webpack導入 es6を動かす es6で書いたコードを動かす どうしてyarnにしてのか yarnとは? ... Command failed with exit code 2 ... KoDDoS ... ・ The source code is in a Git repository in GitHub (your application, infrastructure, and pipeline code), and your CI/CD pipeline is an Azure YAML Pipeline. Azure Container Registry (ACR) is an Azure-native container registry, much like Docker Hub but it’s Azure’s container registry solution, so it integrates with other Azure resources and ... Nov 25, 2020 · Hi, I’ve follow the suggestion in this discussion to build a docker image of theia with inside my extensions: How do I build a docker image with my unpublished extension? Aug 31, 2020 · mohan test wrote:my questions: 1. does kali linux work on macos big sur ? 2. do i need to install any special driver (Kernel driver) 3. as of now i have installed virtual box successfully (by giving allow access in system preferences and restarted by system a couple of times as well), but same issues pops up when i open kali linux. May 09, 2018 · Cleaned yarn and npm cache (yarn cache clean + npm cache clean --force) Upgraded react-scripts to version 3 with yarn add [email protected]; Changed Amplify as a default export (rather than a named export as the tutorial said), because react was complaining about it From import { Amplify } from 'aws-amplify' to import Amplify from 'aws-amplify ...exited, code=exited, status=1/FAILURE авг 21 09:19:51 HackWare systemd[1]: mariadb.service: Failed with result 'exit-code'. авг 21 09:19:51 (sudo:session): session closed for user root авг 21 09:19:59 HackWare sudo[1592]: mial : TTY=pts/0 ; PWD=/home/mial ; USER=root ; COMMAND...From [email protected] Tue Jun 1 07:09:41 2004 Received: by sina.hpc.uh.edu (TLB v0.09a (1.20 tibbs 1996/10/09 22:03:07)); Tue, 01 Jun 2004 07:09:41 -0500 (CDT) Received: from util2.math.uh.edu (util2.math.uh.edu [129.7.128.23]) by sina.hpc.uh.edu (8.9.3/8.9.3) with ESMTP id HAA18014 for ; Tue, 1 Jun 2004 07:09:29 -0500 (CDT) Received: from pop.gmx.de ([213.165.64.20] helo=mail.gmx.net) by ...

Ace hardware tool set

C:\Windows\system32>cd c:\hadoop-2.3.0\bin c:\hadoop-2.3.0\bin>hadoop Usage: hadoop [--config confdir] COMMAND where COMMAND is one of: fs run a generic filesystem user client version print the version jar <jar> run a jar file checknative [-a|-h] check native hadoop and compression libraries availabilit y distcp <srcurl> <desturl> copy file or ... The error is: ld: in /Users/alex/Desktop/Ka226_18-11-2015/ka226/Libraries/libiPhone-lib.a(GeoRingBuffer.o), building for iOS simulator, but linking in object file built for OSX, for architecture x86_64. clang: error: linker command failed with exit code 1 (use -v to see invocation).1.4.1 Code 0 - Successful Completion. This is NOT an error code, the one exception among all other codes you might encounter. If a program returns this code, then ... Package install fails with sed error. Some of the BigBlueButton packages use sed scripts to extract contents from configuration files. If you see [ Fail ], then your nginx configuration files might have a syntax error. Check the syntax of the nginx configuration files using the command.Describe the bug ~/wiki# yarn run dev. . Compile modules Build modules Optimize modules Emit files. GraphQL error: Cannot read property 'code' of null when save page - wiki hot 1.Describe the bug ~/wiki# yarn run dev. . Compile modules Build modules Optimize modules Emit files. GraphQL error: Cannot read property 'code' of null when save page - wiki hot 1.

Vq40de camshaft

Feb 20, 2007 · fsck died with exit status 1. I’ve total 3 hard disk drive connected to my desktop system. Ubuntu hides many details behind its GUI startup screen (read as splash screen). [Launcher] Minecraft closed with exit code: 3. Пожалуйста помогите! Поделиться сообщением. [VersionManager] Versions has been refreshed (87 ms) [Launcher] Launcher exited. [Launcher] Minecraft closed with exit code: 3.

Garmin city navigator north america nt unlocked

ERROR: Failed building wheel for cryptography Running setup.py clean for cryptography Failed to build cryptography ERROR: Could not build wheels for cryptography which use PEP 517 and cannot be installed directly.Aug 22, 2019 · Authentication with Apple Developer Portal failed! bash exited with non-zero code: 2 Error: bash exited with non-zero code: 2 at ChildProcess.completionListener (C:\Users\matt\AppData\Roaming pm ode_modules\expo-cli ode_modules\@expo\spawn-async\src\spawnAsync.ts:65:13) at Object.onceWrapper (events.js:277:13) at ChildProcess.emit (events.js ...

Free figurative language worksheets for 6th grade

The error is: ld: in /Users/alex/Desktop/Ka226_18-11-2015/ka226/Libraries/libiPhone-lib.a(GeoRingBuffer.o), building for iOS simulator, but linking in object file built for OSX, for architecture x86_64. clang: error: linker command failed with exit code 1 (use -v to see invocation).Creative Cloud applications store information about the installation and launch process in log files. This document describes errors you may find in these logs, and provides solutions, where possible. Exit code: 1 Unable to parse command line. Incorrect arguments in command line. Make sure that you ... Exit status 1 npm ERR! npm ERR! Failed at the [email protected] postinstall script. npm ERR! Через yarn так Exit code: 1 Command: node scripts/build.js. Решение.GitHub Gist: instantly share code, notes, and snippets.

Iatse rates 2020

解决hadoop抛出的Task process exit with nonzero status of 134异常(转载) 2012-01-04 hadoop java ant jvm library path Hadoop java.exe finished with nonzero exit value On doing so I got the error as "the command failed with an Exit code 12". Later when I searched in Google, I found that the exit code We are clueless as the occurrence of the issue was not consistent and also can anyone explain what actually is "The access code is invalid" means related to this issue.ManageEngine Applications Manager Authenticated Remote Code Execution Posted Sep 4, 2020 Authored by Hodorsec. ManageEngine Applications Manager authenticated remote code execution exploit that leverages the newInstance() and loadClass() methods being used by the "WeblogicReference", when attempting a Credential Test for a new Monitor. After having developped my Hexagon v65 DSP code with the help of the libnative intrinsics emulation library, I am now trying to port it on the SDK board Open-Q 845. fatal error: error in backend: Do not know how to split the result of this operator! hexagon-clang.exe: error: clang frontend command...To pass a user text to a user exit module, use the NOTIFY MSG command immediately preceding the NOTIFY EXIT or EXIT64 command. For example:.SET NOTIFY HIGH MSG ‘user-text’.SET NOTIFY HIGH EXIT btnfyext. This user text remains in effect until the next NOTIFY MSG command is executed, resulting in all user exit functions receiving the same ... Dec 15, 2019 · And again run the app, and this time you will get this error: Now, there are some more work to be done, as answered in this Stackoverflow post : Require all dependencies you need in the main.js ...